make error

Everything about the installation and compilation

Moderator: feffer

Post Reply
Guest

make error

Post by Guest » Thu Jul 22, 2004 7:15 am

fs_unknown.h:30: error: `struct CInfoUnknownHeader::<anonymous union>::val'
invalid; an anonymous union can only have non-static data members
make[4]: *** [fs_unknown.o] Error 1
make[4]: Leaving directory `/root/work/part/partimage-0.7.1/src/shared/fs'
make[3]: *** [all-recursive] Error 1
make[3]: Leaving directory `/root/work/part/partimage-0.7.1/src/shared'
make[2]: *** [all-recursive] Error 1
make[2]: Leaving directory `/root/work/part/partimage-0.7.1/src'
make[1]: *** [all-recursive] Error 1
make[1]: Leaving directory `/root/work/part/partimage-0.7.1'
make: *** [all] Error 2

Post Reply