compile partimage 6.4 on RHLE 3.0 make error

Everything about the installation and compilation

Moderator: feffer

Post Reply
pcouas
Posts: 25
Joined: Mon Aug 30, 2004 8:00 am

compile partimage 6.4 on RHLE 3.0 make error

Post by pcouas » Mon Aug 30, 2004 8:08 am

Hi,

I try to compile partimage 6.4 on my RHLE 3.0.
./configure is ok
but i have a make error
Regards
Philippe



if g++ -DHAVE_CONFIG_H -DLOCALEDIR=\"/usr/local/share/locale\" -D_REENTRANT -D_F
ILE_OFFSET_BITS=64 -I. -I. -I../.. -I../.. -I../../src/client -I../../src/shared
-I/usr/include/slang -Wno-deprecated -I/usr/include/openssl -Wall -g -O2 -MT
net.o -MD -MP -MF ".deps/net.Tpo" -c -o net.o net.cpp; \
then mv -f ".deps/net.Tpo" ".deps/net.Po"; else rm -f ".deps/net.Tpo"; exit 1; f
i
Dans le fichier inclus à partir de /usr/include/openssl/ssl.h:179,
à partir de structures.h:30,
à partir de net.h:39,
à partir de net.cpp:22:
/usr/include/openssl/kssl.h:72:18: krb5.h: Aucun fichier ou répertoire de ce ty
pe
Dans le fichier inclus à partir de /usr/include/openssl/ssl.h:179,
à partir de structures.h:30,
à partir de net.h:39,
à partir de net.cpp:22:
/usr/include/openssl/kssl.h:134: « krb5_enctype » est utilisé comme type,
mais n'est pas défini comme type.
/usr/include/openssl/kssl.h:136: erreur de syntaxes avantle jeton « * »
/usr/include/openssl/kssl.h:149: erreur de syntaxes avantle jeton « * »
/usr/include/openssl/kssl.h:153: erreur de syntaxes avantle jeton « * »
/usr/include/openssl/kssl.h:155: erreur de syntaxes avantle jeton « * »
/usr/include/openssl/kssl.h:157: erreur de syntaxes avantle jeton « * »
/usr/include/openssl/kssl.h:159: erreur de syntaxes avantle jeton « * »
/usr/include/openssl/kssl.h:161: « krb5_context » n'a pas été déclaré
dans cet horizon
/usr/include/openssl/kssl.h:161: erreur de syntaxes avantle jeton « , »
/usr/include/openssl/kssl.h:162: « krb5_context » n'a pas été déclaré
dans cet horizon
/usr/include/openssl/kssl.h:162: erreur de syntaxes avantle jeton « , »
/usr/include/openssl/kssl.h:165: « krb5_timestamp » n'a pas été déclaré
dans cet horizon
/usr/include/openssl/kssl.h:165: erreur de syntaxes avantle jeton « , »
/usr/include/openssl/kssl.h:167: erreur de syntaxes avantle jeton « * »
/usr/include/openssl/kssl.h:169: « krb5_enctype » n'a pas été déclaré
dans cet horizon
/usr/include/openssl/kssl.h:169: erreur de syntaxes avantle jeton « , »
make[3]: *** [net.o] Erreur 1
make[3]: Quitte le répertoire `/datas/phi/util/unix_logiciel/partitionnement/pa
rtimage/src/partimage-0.6.4/src/shared'
make[2]: *** [all-recursive] Erreur 1
make[2]: Quitte le répertoire `/datas/phi/util/unix_logiciel/partitionnement/pa
rtimage/src/partimage-0.6.4/src'
make[1]: *** [all-recursive] Erreur 1
make[1]: Quitte le répertoire `/datas/phi/util/unix_logiciel/partitionnement/pa
rtimage/src/partimage-0.6.4'
make: *** [all] Erreur 2

Guest

Post by Guest » Tue Aug 31, 2004 6:51 am

Hi i found an RPM 0.6.4 for my RHLE 3.0

Regards

Post Reply