Make error

Everything about the installation and compilation

Moderator: feffer

Post Reply
rungis
Posts: 1
Joined: Wed Nov 28, 2007 10:27 am

Make error

Post by rungis » Wed Nov 28, 2007 10:32 am

Hello,
I've compiled correctly the source of partimage without errors but when i install the package i received any errors:

Code: Select all

www:/usr/src/partimage-0.6.6# make
make  all-recursive
make[1]: entrant dans le répertoire « /usr/src/partimage-0.6.6 »
Making all in m4
make[2]: entrant dans le répertoire « /usr/src/partimage-0.6.6/m4 »
make[2]: Rien à faire pour « all ».
make[2]: quittant le répertoire « /usr/src/partimage-0.6.6/m4 »
Making all in po
make[2]: entrant dans le répertoire « /usr/src/partimage-0.6.6/po »
make[2]: Rien à faire pour « all ».
make[2]: quittant le répertoire « /usr/src/partimage-0.6.6/po »
Making all in src
make[2]: entrant dans le répertoire « /usr/src/partimage-0.6.6/src »
Making all in shared
make[3]: entrant dans le répertoire « /usr/src/partimage-0.6.6/src/shared »
source='common.cpp' object='common.o' libtool=no \
        DEPDIR=.deps depmode=none /bin/sh ../../depcomp \
	        g++ -DHAVE_CONFIG_H -DLOCALEDIR=\"/usr/local/share/locale\" -D_REENTRANT -D_FILE_OFFSET_BITS=64 -I. -I. -I../.. -I../.. -I../../src/client -I../../src/shared -I/usr/include/slang  -Wno-deprecated -I/usr/include/openssl -Wall   -c -o common.o common.cpp
		../../depcomp: line 502: exec: g++: not found
		make[3]: *** [common.o] Erreur 127
		make[3]: quittant le répertoire « /usr/src/partimage-0.6.6/src/shared »
		make[2]: *** [all-recursive] Erreur 1
		make[2]: quittant le répertoire « /usr/src/partimage-0.6.6/src »
		make[1]: *** [all-recursive] Erreur 1
		make[1]: quittant le répertoire « /usr/src/partimage-0.6.6 »
		make: *** [all] Erreur 2

Can you help plz ?

Thanks

Hunter123
Posts: 3
Joined: Wed Jun 25, 2008 1:46 pm

same

Post by Hunter123 » Wed Jun 25, 2008 5:32 pm

having same problem and I do the

apt-get update
apt-get install build-essential

but apt-get install build-essential gives me this error


apt-get install build-essential
Reading Package Lists... Done
Building Dependency Tree... Done
E: Couldn't find package build-essential

help please!

Hartmut
Posts: 26
Joined: Thu Aug 26, 2010 10:06 am

Re: same

Post by Hartmut » Tue Nov 16, 2010 2:27 pm

maykesha08 wrote:Yes same problem, does any way to avoid error i really hate starting over and over again and looking whats the error.
Try installing the g++ package :wink:

Post Reply